Cognition
scope note: S'emploie également en subdivision
scope note: Sous cette vedette, on trouve les ouvrages sur l'acte de connaissance, appréhension du monde, d'un point de vue psychologique. Les méthodes permettant d'étudier l'activité cognitive : conception de modèles de l'activité mentale et de méthodes d'observation et de validation des modèles cognitifs, sont entrés sous la vedette Psychologie cognitive. Les ouvrages sur l'ensemble des sciences qui portent sur la cognition : psychologie cognitive, linguistique, logique, recherches en intelligence artificielle et traitement de l'information chez l'homme, sont entrés sous Sciences cognitives
P61160: http://www.rdaregistry.info/termList/statIdentification/1001
related: cb12116308v
narrower: cb12308986x
alternative label: Processi cognitivi @it
related: https://data.bnf.fr/ark:/12148/cb11975087d
narrower: https://data.bnf.fr/ark:/12148/cb150933964
narrower: cb14602443m
narrower: cb12492665q
alternative label: Aspect cognitif
related: cb18006508v
narrower: cb14569342r
narrower: cb12237353h
modified: 2024-05-23
narrower: cb11933068t
FRBNF: 11931219
narrower: cb13512691x
narrower: cb11930987v
narrower: cb17790473h
narrower: https://data.bnf.fr/ark:/12148/cb119492232
narrower: cb12303769k
narrower: cb16714524r
broader: https://data.bnf.fr/ark:/12148/cb119408497
narrower: cb11947837x
alternative label: Et la cognition
narrower: cb12497481m
narrower: cb16735826x
narrower: https://data.bnf.fr/ark:/12148/cb11951806d
narrower: cb11942016j
narrower: cb11968525r
narrower: https://data.bnf.fr/ark:/12148/cb131697781
narrower: https://data.bnf.fr/ark:/12148/cb119667892
narrower: cb11978103j
narrower: cb11933067g
narrower: https://data.bnf.fr/ark:/12148/cb119812291
narrower: https://data.bnf.fr/ark:/12148/cb12173305b
related: https://data.bnf.fr/ark:/12148/cb119339073
narrower: cb11981952g
type: Concept
created: 1985-07-06
narrower: cb17151030h
alternative label: Connaissance
narrower: https://data.bnf.fr/ark:/12148/cb119326327
related: https://data.bnf.fr/ark:/12148/cb11941425c
related: cb12117451h
is part of: r166
domaine: https://data.bnf.fr/ark:/12148/cb119408497
related: https://data.bnf.fr/ark:/12148/cb12312898d

Cognition

Processi cognitivi