France (nord)
broader: https://data.bnf.fr/ark:/12148/cb119314762
type: Concept
scope note: Sous cette vedette, on trouve les documents qui traitent de la moitié nord de la France
FRBNF: 11931524
modified: 2017-05-02
domaine litteral: Géographie de la France
created: 1985-07-06
alternative label: Nord de la France
alternative label: France septentrionale
is part of: r167
narrower: cb11974020w
alternative label: France du nord
P61160: http://www.rdaregistry.info/termList/statIdentification/1001
narrower: cb11974019p

France, Northern