Portugal
related: https://data.bnf.fr/ark:/12148/cb11940850f
FRBNF: 11932845
related: https://data.bnf.fr/ark:/12148/cb131689023
broader: https://data.bnf.fr/ark:/12148/cb11934129f
related: https://data.bnf.fr/ark:/12148/cb12166866f
related: cb12037132n
related: cb12170877v
is part of: r167
scope note: Voir aussi la subdivision Et le Portugal aux collectivités et personnes
related: https://data.bnf.fr/ark:/12148/cb160846279
broader: https://data.bnf.fr/ark:/12148/cb119320646
type: Concept
P61160: http://www.rdaregistry.info/termList/statIdentification/1001
created: 1985-07-06
domaine litteral: Géographie de l'Europe
related: cb12154139x
related: https://data.bnf.fr/ark:/12148/cb120691840
modified: 2017-02-13

Portugal