Sculpteurs
narrower: cb11988383s
related match: Sculptors
created: 1985-07-06
scope note: Voir aussi les vedettes du type Sculpteurs [adjectif de nationalité ou géographique]
P61160: http://www.rdaregistry.info/termList/statIdentification/1001
narrower: https://data.bnf.fr/ark:/12148/cb119833660
related: https://data.bnf.fr/ark:/12148/cb15996790f
narrower: https://data.bnf.fr/ark:/12148/cb119614729
type: Concept
FRBNF: 11933239
modified: 2023-06-08
alternative label: Artistes sculpteurs
editorial note: Nouveau Littré 2006. - . - Nouveau petit Robert 2010. - . - Trésor de la langue française. - . -
domaine litteral: Catégories de personnes
narrower: cb12104643h
domaine: https://data.bnf.fr/ark:/12148/cb11933241b
broader: cb13318455m
is part of: r166
related: https://data.bnf.fr/ark:/12148/cb11933241b