Turquie
related: https://data.bnf.fr/ark:/12148/cb180779853
related: cb12173297j
related: cb15844652x
related: https://data.bnf.fr/ark:/12148/cb124254136
domaine litteral: Géographie du reste du monde
narrower: https://data.bnf.fr/ark:/12148/cb121923808
type: Concept
related: https://data.bnf.fr/ark:/12148/cb119335446
narrower: cb11979526j
editorial note: Grand Larousse universel. - . - Robert encyclopédique des noms propres 2008. - . - Encycl. universalis. - http://www.universalis-edu.com. - 2016-12-02
narrower: https://data.bnf.fr/ark:/12148/cb119791253
related: cb11944568n
scope note: Voir aussi la subdivision Et la Turquie [sans subd. géogr.] aux collectivités et aux personnes
broader: https://data.bnf.fr/ark:/12148/cb11941591f
is part of: r167
related: https://data.bnf.fr/ark:/12148/cb121285230
P61160: http://www.rdaregistry.info/termList/statIdentification/1001
FRBNF: 11933721
domaine litteral: Géographie de l'Europe
narrower: cb13771575r
related: https://data.bnf.fr/ark:/12148/cb120749052
related: https://data.bnf.fr/ark:/12148/cb119309824
scope note: Sous cette vedette, on trouve les documents sur la Turquie dans ses frontières actuelles, ou de la seule Anatolie (terme qui pour les Turcs désigne toute la Turquie d'Asie). Les documents sur l'ensemble de la Turquie avant 1922 se trouvent sous Empire ottoman ; ceux sur l'Anatolie antique, byzantine et ottomane se trouvent sous Asie Mineure
modified: 2016-12-02
related: cb12105195m
related: https://data.bnf.fr/ark:/12148/cb131684152
related: cb11935673j
scope note: Voir aussi la subdivision Opinion publique turque [sans subd. géogr.] aux guerres et aux lieux
related: cb11982402s
created: 1985-07-06
related: https://data.bnf.fr/ark:/12148/cb120050715