Zimbabwe
type: Concept
related: cb12237323k
related: cb13194677t
modified: 2017-02-13
narrower: https://data.bnf.fr/ark:/12148/cb159139522
P61160: http://www.rdaregistry.info/termList/statIdentification/1001
related: cb11933831p
related: https://data.bnf.fr/ark:/12148/cb165041781
related: cb12175603z
scope note: Voir aussi la subdivision Et le Zimbabwe [sans subd. géogr.] aux collectivités et aux personnes
note: La Rhodésie du Sud, dont la minorité blanche proclama l'indépendance le 11 novembre 1965 sous le nom de Rhodésie, est devenue le Zimbabwe le 18 avril 1980
related: cb12502844m
related: cb16628936v
domaine litteral: Géographie du reste du monde
related: cb12129148g
is part of: r167
related: https://data.bnf.fr/ark:/12148/cb17064986c
related: cb12175605n
created: 1985-07-06
FRBNF: 11933830
related: cb15549018s
broader: cb11943016s

Zimbabwe