Semiconducteurs
narrower: cb12292939n
related: https://data.bnf.fr/ark:/12148/cb171528241
alternative label: Semiconducteurs électroniques
narrower: https://data.bnf.fr/ark:/12148/cb124219995
narrower: https://data.bnf.fr/ark:/12148/cb122670163
alternative label: Semi-conducteurs
narrower: cb11978659j
narrower: cb12064112x
scope note: Voir aussi aux matériaux semiconducteurs particuliers, par ex. : Silicium
narrower: https://data.bnf.fr/ark:/12148/cb135064093
created: 1985-07-06
narrower: https://data.bnf.fr/ark:/12148/cb119667710
related: https://data.bnf.fr/ark:/12148/cb119403595
broader: cb11944392z
alternative label: Matériaux semiconducteurs
narrower: https://data.bnf.fr/ark:/12148/cb122674793
narrower: https://data.bnf.fr/ark:/12148/cb122853594
narrower: cb12111317m
narrower: cb11966722s
narrower: cb12287381s
narrower: https://data.bnf.fr/ark:/12148/cb16153019b
modified: 2018-12-07
narrower: cb12125621v
narrower: https://data.bnf.fr/ark:/12148/cb13755972c
domaine: cb11933639w
alternative label: Semiconducteurs cristallins
broader: https://data.bnf.fr/ark:/12148/cb11978662f
alternative label: Semiconducteurs intrinsèques
narrower: https://data.bnf.fr/ark:/12148/cb122674809
broader: cb11934822z
narrower: cb11940133x
domaine: cb11933127h
narrower: cb17708765s
narrower: cb13532466k
narrower: https://data.bnf.fr/ark:/12148/cb11958732c
narrower: cb12258824z
narrower: cb11933621t
type: Concept
related: https://data.bnf.fr/ark:/12148/cb12261517c
narrower: https://data.bnf.fr/ark:/12148/cb122665941
narrower: https://data.bnf.fr/ark:/12148/cb120632615
narrower: https://data.bnf.fr/ark:/12148/cb13325534d
narrower: https://data.bnf.fr/ark:/12148/cb121021998
broader: cb11978663s
narrower: https://data.bnf.fr/ark:/12148/cb119594783
P61160: http://www.rdaregistry.info/termList/statIdentification/1001
narrower: cb11932231s
is part of: r166
narrower: https://data.bnf.fr/ark:/12148/cb119786613
narrower: https://data.bnf.fr/ark:/12148/cb12556474f
alternative label: Composants à semiconducteurs
narrower: cb12258235z
broader: cb11941210s
FRBNF: 11935848
related: cb13179368t
related: cb11978660r
editorial note: Grand Larousse universel : semi-conducteur. - . - Grand Robert de la langue française, 2001 : semi-conducteur. - . -
alternative label: Dispositifs à semiconducteurs
narrower: cb13163535r
narrower: https://data.bnf.fr/ark:/12148/cb122664535
narrower: cb13572932g
narrower: cb12266454h

Semiconductors