Chocolat
related: https://data.bnf.fr/ark:/12148/cb170421988
modified: 2017-12-14
domaine litteral: Économie domestique. Cuisine
related: https://data.bnf.fr/ark:/12148/cb119733972
alternative label: Pâte de chocolat
broader: cb11964747n
FRBNF: 11949124
created: 1985-07-06
related: cb14600342h
domaine litteral: Agriculture. Pêche
related: cb11964885g
related: https://data.bnf.fr/ark:/12148/cb166016912
related: cb12087938z
is part of: r166
type: Concept
scope note: Sous cette vedette, on trouve les documents sur le produit alimentaire préparé avec des fèves de cacao et du sucre. Les documents sur les confiseries chocolatées se trouvent sous Chocolats. Les documents sur la cuisine au chocolat se trouvent sous Cuisine (chocolat)
editorial note: Trésor de la langue française. - . - Dict. d'agriculture : français-anglais-allemand / Conseil international de la langue française, 1999. - . -
narrower: https://data.bnf.fr/ark:/12148/cb170947048
related: https://data.bnf.fr/ark:/12148/cb119580197
related: cb16141034j
P61160: http://www.rdaregistry.info/termList/statIdentification/1001

Chocolate