Jusqu'à 1500
FRBNF: 11976240
is part of: r168
note: 12 octobre 1492 : Christophe Colomb aborde aux Bahamas. 22 novembre 1497 : Vasco de Gama double le cap de Bonne-Espérance
type: Concept
P61160: http://www.rdaregistry.info/termList/statIdentification/1001
is part of: r166
narrower: https://data.bnf.fr/ark:/12148/cb119757175
created: 1985-07-06
domaine: https://data.bnf.fr/ark:/12148/cb119344445
scope note: S'emploie uniquement en subdivision chronologique [sans subd. géogr.] à tous sujets noms communs et noms propres, à l'exception des personnes et des sujets pour lesquels il existe un découpage chronologique spécifique, par ex. : Mexique -- Jusqu'à 1519. - Ne pas employer aux littératures
narrower: cb11975677r
alternative label: +*-9900......- 1492......+:Époque précolombienne:
alternative label: Jusqu'à 1500 (subdivision)
modified: 2017-02-13
narrower: cb16770072h
related: cb11975830n
related match: History--To 1500
broader: https://data.bnf.fr/ark:/12148/cb119344445
scope note: Voir aussi la subdivision Avant 1500 à certaines vedettes de littératures et de genres littéraires, par ex. : Poésie vietnamienne -- Avant 1500