Professions
narrower: https://data.bnf.fr/ark:/12148/cb119323521
narrower: cb11952284s
related: https://data.bnf.fr/ark:/12148/cb11978235f
scope note: Voir aussi les subdivisions Carrière -- [Domaine] aux personnes
scope note: Voir aussi la subdivision Orientation professionnelle aux collectivités, catégories de personnes, industries et sujets noms communs appropriés (domaines)
alternative label: Activité professionnelle
FRBNF: 13318415
is part of: r166
alternative label: Postes de travail
type: Concept
narrower: cb11983317s
narrower: https://data.bnf.fr/ark:/12148/cb119756574
narrower: cb15832621z
narrower: cb11985686x
narrower: cb11974328g
related: https://data.bnf.fr/ark:/12148/cb121259868
related: https://data.bnf.fr/ark:/12148/cb17007720c
narrower: cb12042432g
narrower: https://data.bnf.fr/ark:/12148/cb119550154
domaine litteral: Économie politique. Travail
narrower: https://data.bnf.fr/ark:/12148/cb119510840
narrower: https://data.bnf.fr/ark:/12148/cb119510720
related: cb16263406g
narrower: cb11975984v
narrower: cb12536476q
related: https://data.bnf.fr/ark:/12148/cb119329202
related: cb11980921z
alternative label: Carrières
narrower: https://data.bnf.fr/ark:/12148/cb167178051
related: cb13318639x
scope note: Voir aussi la subdivision Pratique aux sujets noms communs appropriés (domaines professionnels)
modified: 2024-02-05
P61160: http://www.rdaregistry.info/termList/statIdentification/1001
created: 1985-07-06
narrower: https://data.bnf.fr/ark:/12148/cb162635491
alternative label: Vie professionnelle
related: https://data.bnf.fr/ark:/12148/cb133254224
narrower: cb11983489x
narrower: cb11955008v
related: cb11975857p
alternative label: Emplois (professions)
alternative label: Activités professionnelles

Occupations