Chinois (langue)
related: cb12319984p
related: cb12474923p
related: https://data.bnf.fr/ark:/12148/cb119686193
narrower: cb11957024k
related: cb12011709x
related: cb14476972n
related: cb14564300m
related: cb12518581n
alternative label: Hanyu (langue)
alternative label: Chinois mandarin (langue)
scope note: Sous cette vedette, on trouve les documents sur la langue chinoise (forme officielle dite mandarin ou putonghua) en général, ainsi que sur le chinois moderne. Les documents sur l'ensemble des langues ou dialectes du groupe chinois se trouvent sous Langues chinoises
related: https://data.bnf.fr/ark:/12148/cb125455539
P61160: http://www.rdaregistry.info/termList/statIdentification/1001
narrower: https://data.bnf.fr/ark:/12148/cb11998294c
related: cb14563397k
related: https://data.bnf.fr/ark:/12148/cb121147806
type: Concept
related: cb12008551n
alternative label: Chinois moderne (langue)
FRBNF: 11949219
narrow match: Mandarin dialects
alternative label: Xiandai Hanyu (langue)
related: https://data.bnf.fr/ark:/12148/cb13187626f
related: https://data.bnf.fr/ark:/12148/cb18046580d
alternative label: Chinois standard (langue)
related: cb15083587h
narrower: cb11953442n
alternative label: Chinois (langue) moderne
alternative label: Chinois (langue) -- 1919-.... (chinois moderne)
related: cb11968501r
related: https://data.bnf.fr/ark:/12148/cb11980165c
related: cb16954797p
related: https://data.bnf.fr/ark:/12148/cb121424319
alternative label: Dialectes mandarins
narrower: cb12564389x
related: cb13620194g
alternative label: Kuo yu (langue)
modified: 2023-06-08
related: cb14630187j
created: 1985-07-06
alternative label: Guoyu (langue)
alternative label: Guanhua (langue)
related: https://data.bnf.fr/ark:/12148/cb119774003
broader: https://data.bnf.fr/ark:/12148/cb121692059
alternative label: Putonghua (langue)
editorial note: Les langues du monde / M. Sala, I. Vintila-Radulescu, 1984. - . - L'aménagement linguistique dans le monde : chinois mandarin ; putonghua. - http://www.tlfq.ulaval.ca. - 2010-03-12 Ethnologue (16th ed.) : Chinese, Mandarin. - http://www.ethnologue.com. - 2010-03-12
related: cb12061146h
domaine litteral: Langues
alternative label: Beifang fangyan (langue)
related: cb11980995h
related: cb16770361p
related: https://data.bnf.fr/ark:/12148/cb11936858f
related: cb12098440k
related: https://data.bnf.fr/ark:/12148/cb124502310
related: cb12165525s
related: cb12010773s
editorial note: Grand Larousse universel (art. : Chinois) : mandarin ; putonghua. - . - Encycl. universalis (art. : Chine (L'Empire du Milieu) - Littérature) : mandarin ; dialectes mandarins. - http://www.universalis-edu.com. - 2010-03-12
alternative label: Mandarin (langue)
is part of: r166
related: https://data.bnf.fr/ark:/12148/cb131968933
related: cb14483174m
related: cb15118784z

Chinese language