Biologie moléculaire
narrower: https://data.bnf.fr/ark:/12148/cb12254735c
narrower: https://data.bnf.fr/ark:/12148/cb135775348
narrower: https://data.bnf.fr/ark:/12148/cb125672761
created: 1985-07-06
modified: 2023-06-07
type: Concept
narrower: cb11965244g
scope note: Voir aussi la subdivision Métabolisme aux êtres vivants, parties du corps et produits chimiques
narrower: https://data.bnf.fr/ark:/12148/cb17157873f
narrower: cb12412454v
narrower: https://data.bnf.fr/ark:/12148/cb161864173
related: cb15597104x
alternative label: Biochimie moléculaire
scope note: Voir aussi la subdivision Aspect moléculaire aux maladies et parties du corps
related: cb11931061x
narrower: cb12258538t
narrower: cb13743497n
FRBNF: 11931064
related: https://data.bnf.fr/ark:/12148/cb119383963
narrower: https://data.bnf.fr/ark:/12148/cb151239506
related: cb11979284w
narrower: https://data.bnf.fr/ark:/12148/cb125672792
narrower: cb13577536z
narrower: cb12288031n
related: https://data.bnf.fr/ark:/12148/cb121250080
narrower: https://data.bnf.fr/ark:/12148/cb169485329
is part of: r166
narrower: cb11931559r
related match: Molecular biology
domaine: https://data.bnf.fr/ark:/12148/cb119440835
narrower: cb16200711x
narrower: https://data.bnf.fr/ark:/12148/cb125460504
P61160: http://www.rdaregistry.info/termList/statIdentification/1001
alternative label: Biophysique moléculaire
narrower: https://data.bnf.fr/ark:/12148/cb122895031
related: https://data.bnf.fr/ark:/12148/cb12231420c
broader: https://data.bnf.fr/ark:/12148/cb119440835