Ingénieurs
domaine litteral: Économie politique. Travail
narrower: https://data.bnf.fr/ark:/12148/cb124564341
related: cb12116200t
FRBNF: 11932114
is part of: r166
domaine: cb11933639w
related match: Engineers
narrower: cb12127171h
related: cb11932033x
domaine litteral: Sciences sociales. Sociologie
narrower: https://data.bnf.fr/ark:/12148/cb13171138d
related: https://data.bnf.fr/ark:/12148/cb119623519
narrower: https://data.bnf.fr/ark:/12148/cb11940420d
narrower: cb12118517v
P61160: http://www.rdaregistry.info/termList/statIdentification/1001
related: https://data.bnf.fr/ark:/12148/cb119444671
created: 1985-07-06
narrower: https://data.bnf.fr/ark:/12148/cb119321158
scope note: Voir aussi les vedettes commençant par le mot Ingénieurs
narrower: https://data.bnf.fr/ark:/12148/cb11961872d
related: cb13175398s
modified: 2018-09-11
narrower: https://data.bnf.fr/ark:/12148/cb124453229
broader: cb16694116h
type: Concept
narrower: https://data.bnf.fr/ark:/12148/cb119719857