Japonais (langue)
related: cb12294758v
modified: 2023-06-07
related: cb12481239m
narrower: https://data.bnf.fr/ark:/12148/cb135132467
related: https://data.bnf.fr/ark:/12148/cb146519413
related: cb15580804z
related: cb16067122h
related: cb15093941h
note: Langue du Japon
related: https://data.bnf.fr/ark:/12148/cb122653540
editorial note: Les langues du monde / A. Meillet, M. Cohen, 1981. - . - Les langues du monde / M. Sala, I. Vintila-Radulescu, 1984. - . - Ethnologue (16th ed.) : Japanese. - http://www.ethnologue.com. - 2010-02-05
type: Concept
created: 1985-07-06
domaine litteral: Langues
is part of: r166
narrower: https://data.bnf.fr/ark:/12148/cb135075177
related: cb11985601q
related: cb12011838s
alternative label: Nippon (langue)
related: cb16770944r
FRBNF: 11932171
related: cb12135752m
related: cb17965118g
broader: https://data.bnf.fr/ark:/12148/cb11966910b
narrower: https://data.bnf.fr/ark:/12148/cb135126719
related: https://data.bnf.fr/ark:/12148/cb162427953
editorial note: Grand Larousse universel. - . - Encycl. universalis. - http://www.universalis-edu.com. - 2010-02-05
alternative label: Nihongo (langue)
related: https://data.bnf.fr/ark:/12148/cb12293027d
narrower: cb11961621z
related: cb13746110n
scope note: Sous cette vedette, on trouve les documents sur la langue japonaise en général, dans ses différentes formes au cours de l'histoire, et sur le japonais moderne. Les documents sur un état historique particulier se trouvent sous les vedettes spécifiques, par ex. : Japonais (langue) -- 1185-1600
related: cb14630221w
related: cb11947362r
alternative label: Nipon (langue)
related: cb15083594s
related: https://data.bnf.fr/ark:/12148/cb157661570
narrower: https://data.bnf.fr/ark:/12148/cb135126730
related: https://data.bnf.fr/ark:/12148/cb121052847
related: https://data.bnf.fr/ark:/12148/cb150835598
alternative label: Ni.hon.go (langue)
alternative label: Nippongo (langue)
related: cb12127507h
narrower: cb11947304k
related: cb17054180w
related: cb13168501n
P61160: http://www.rdaregistry.info/termList/statIdentification/1001

Japanese language