Manuscrits à peintures
alternative label: Manuscrits enluminés
scope note: Voir aussi les vedettes Manuscrits à peintures suivies d'un adjectif de civilisation, de langue ou de périodisation
narrower: cb13192784w
modified: 2023-06-07
type: Concept
alternative label: Manuscrits à enluminures
domaine litteral: Dessin. Arts décoratifs
is part of: r166
narrower: https://data.bnf.fr/ark:/12148/cb13553869c
P61160: http://www.rdaregistry.info/termList/statIdentification/1001
related match: Illumination of books and manuscripts
scope note: Sous cette vedette, on trouve les documents qui traitent du support de l'enluminure, c'est-à-dire des manuscrits enluminés, pour établir leur histoire, les décrire, les répertorier en vue d'en constituer le catalogue. Les documents sur l'ornementation de ces manuscrits se trouvent sous la vedette Enluminure
narrower: cb12513749h
created: 1985-07-06
related: cb13318311q
broader: cb13318362m
FRBNF: 11932413
domaine litteral: Sciences de l'information et de la documentation