Méditation
alternative label: Pratique méditative
editorial note: Grand Larousse universel. - . - Encycl. universalis. - http://www.universalis-edu.com. - 2017-01-02
related: cb11932992x
editorial note: Dict. des religions / P. Poupard, 1993. - . - Encycl. des religions / F. Lenoir, Y. Tardan-Masquelier, 1997 (p. 2295-2305). - . - Encycl. des religions / J. Bersani, C. Baladier, 1991 (index). - . -
related match: Meditation
narrower: https://data.bnf.fr/ark:/12148/cb16578854c
narrower: cb11952506t
domaine: https://data.bnf.fr/ark:/12148/cb119408497
domaine: cb11963568t
broader: cb15608357m
narrower: cb12027950k
broader: https://data.bnf.fr/ark:/12148/cb11934679c
related: https://data.bnf.fr/ark:/12148/cb14560702f
narrower: cb16031057t
narrower: cb11936589w
alternative label: Recueillement
scope note: Sous cette vedette, on trouve les documents sur la méditation comme moyen de progrès dans la vie spirituelle. Les recueils généraux ou chrétiens de pensées ou de réflexions sur des vérités spirituelles se trouvent sous Méditations
narrower: cb12336912h
narrower: cb12008529g
alternative label: Prière mentale
is part of: r166
narrower: cb15565510v
FRBNF: 11932470
type: Concept
modified: 2018-09-11
related: cb11975989k
scope note: Peut se subdiviser par nom de religion, confession ou secte
P61160: http://www.rdaregistry.info/termList/statIdentification/1001
created: 1985-07-06