Plantes
related match: Plants
narrower: cb12136147m
alternative label: Flore
related: cb16929889x
alternative label: Trachéophytes
narrower: cb12136148z
P61160: http://www.rdaregistry.info/termList/statIdentification/1001
related: cb11939613n
alternative label: Végétation
alternative label: Végétaux
type: Concept
alternative label: Plantes non vasculaires
related: https://data.bnf.fr/ark:/12148/cb119460542
related: https://data.bnf.fr/ark:/12148/cb122648900
related: cb17744443h
alternative label: Règne végétal
FRBNF: 11933145
modified: 2023-06-08
alternative label: Plantes vasculaires
related: cb11981457t
related: cb16543367h
related: cb12009322r
related: https://data.bnf.fr/ark:/12148/cb120090656
domaine: https://data.bnf.fr/ark:/12148/cb119460542
related: cb11940827x
related: cb17848073g
scope note: Sous cette vedette, on trouve notamment les documents couramment appelés Flore (d'un pays, d'une région), pour lesquels on fait suivre Plantes de la subdivision géographique appropriée
is part of: r166
related: cb11946245n
created: 1985-07-06