Statues
alternative label: Art statuaire
broader: https://data.bnf.fr/ark:/12148/cb11933241b
related: https://data.bnf.fr/ark:/12148/cb162515093
narrower: https://data.bnf.fr/ark:/12148/cb150809767
modified: 2023-11-28
related: https://data.bnf.fr/ark:/12148/cb12377575c
narrower: cb18116705r
scope note: S'emploie également en subdivision
FRBNF: 11933315
related: cb11948962n
type: Concept
scope note: Voir aussi aux noms des statues particulières, par ex. : Rodin, Auguste (1840-1917). Balzac
alternative label: Statuaires
is part of: r166
narrower: cb12333290n
narrower: https://data.bnf.fr/ark:/12148/cb125654434
narrower: https://data.bnf.fr/ark:/12148/cb11946157c
editorial note: Nouveau Littré 2006. - . - Nouveau petit Robert 2010. - . -
narrower: https://data.bnf.fr/ark:/12148/cb136003024
narrower: https://data.bnf.fr/ark:/12148/cb124330443
related: cb12218390j
related: https://data.bnf.fr/ark:/12148/cb119325230
narrower: https://data.bnf.fr/ark:/12148/cb169445957
P61160: http://www.rdaregistry.info/termList/statIdentification/1001
narrower: cb12357700m
narrower: https://data.bnf.fr/ark:/12148/cb16581561b
domaine: https://data.bnf.fr/ark:/12148/cb11933241b
created: 1985-07-06
narrower: https://data.bnf.fr/ark:/12148/cb12045730b

Statues