Taoïsme
related: https://data.bnf.fr/ark:/12148/cb167217312
related: cb11936570g
modified: 2023-06-07
related: cb11979301n
related: cb15055468t
alternative label: Et le taoïsme
narrower: cb11942374j
editorial note: Nouveau petit Robert 2010. - . - Encyclopédie des religions, Universalis, 1991. - . -
type: Concept
narrower: cb13183702r
narrower: https://data.bnf.fr/ark:/12148/cb121628712
related: https://data.bnf.fr/ark:/12148/cb125698645
related: cb11980157r
narrower: cb12226205x
narrower: https://data.bnf.fr/ark:/12148/cb180174577
scope note: S'emploie également en subdivision aux sujets religieux
alternative label: Taochia
narrower: https://data.bnf.fr/ark:/12148/cb11952466d
P61160: http://www.rdaregistry.info/termList/statIdentification/1001
related: cb12158511m
narrower: cb12042093k
broader: https://data.bnf.fr/ark:/12148/cb119346708
FRBNF: 11933592
broader: https://data.bnf.fr/ark:/12148/cb120859761
created: 1985-07-06
narrower: cb11950937q
related: https://data.bnf.fr/ark:/12148/cb136042542
related: cb16775429p
related: cb11970833g
is part of: r166
alternative label: Tao-kia
domaine: cb11963568t

Taoism