Technique
narrower: https://data.bnf.fr/ark:/12148/cb11979189b
alternative label: Mode opératoire
narrower: https://data.bnf.fr/ark:/12148/cb123662513
related: cb11930969x
alternative label: Modes opératoires
P61160: http://www.rdaregistry.info/termList/statIdentification/1001
related: https://data.bnf.fr/ark:/12148/cb119338890
scope note: Voir aussi les vedettes commençant par Technique ; Techniques, par ex. : Technique du livre
scope note: Voir aussi la subdivision Culture matérielle aux groupes ethniques
is part of: r166
alternative label: Et la technique
created: 1985-07-06
scope note: S'emploie également en subdivision
related: https://data.bnf.fr/ark:/12148/cb16260072f
related: cb11946924m
type: Concept
scope note: Sous cette vedette, on trouve les documents qui étudient, de manière globale, les applications pratiques de la science et leurs implications. Cette notion est à distinguer de la Technologie qui envisage les applications particulières de la connaissance scientifique aux différentes branches de la production, aux différentes professions, etc., ainsi que l'étude des méthodes, appareils et matériel qui leur sont propres
related: https://data.bnf.fr/ark:/12148/cb124467308
modified: 2023-11-23
alternative label: Techniques
FRBNF: 11933639
narrower: cb11993332w
related: cb11932499z
related: https://data.bnf.fr/ark:/12148/cb150933964
scope note: S'emploie également en subdivision aux personnes pour des études sur leur technique littéraire, artistique, etc., ainsi qu'aux littératures et sujets noms communs appropriés (artistiques, scientifiques et techniques, etc.) pour des études sur les techniques propres à ces sujets, par ex. : Danse -- Technique ; Pâtisserie -- Technique
related: https://data.bnf.fr/ark:/12148/cb119323521
related: cb11954032g
narrower: cb11968859w
related: https://data.bnf.fr/ark:/12148/cb11933596f
related: cb12440060t

Technique