Sécurité sociale
alternative label: Régime général de Sécurité sociale
narrower: https://data.bnf.fr/ark:/12148/cb11937755c
related: https://data.bnf.fr/ark:/12148/cb11964728c
related match: Social security
alternative label: Sécurité sociale -- Régime général
alternative label: Couverture sociale
related: https://data.bnf.fr/ark:/12148/cb12126096b
alternative label: Assurances sociales
domaine litteral: Problèmes et services sociaux. Criminologie
note: Ensemble des mesures collectives, légales, assurant des garanties contre certains risques sociaux : maladie, maternité, invalidité, vieillesse, etc.
narrower: https://data.bnf.fr/ark:/12148/cb119340353
narrower: https://data.bnf.fr/ark:/12148/cb11982876f
type: Concept
is part of: r166
related: https://data.bnf.fr/ark:/12148/cb119761826
alternative label: Prévoyance sociale
narrower: cb11967411j
related: cb11951140n
narrower: cb12147591n
narrower: https://data.bnf.fr/ark:/12148/cb119822178
P61160: http://www.rdaregistry.info/termList/statIdentification/1001
narrower: cb11967802p
narrower: https://data.bnf.fr/ark:/12148/cb16150097d
broader: https://data.bnf.fr/ark:/12148/cb119613961
alternative label: Assurance sociale
created: 1985-07-06
narrower: cb12043303v
alternative label: Prestations sociales
narrower: cb11950045v
narrower: cb13615210w
scope note: Voir aussi les vedettes du type : Sécurité sociale -- [Catégorie d'assurés], par ex. : Sécurité sociale -- Fonctionnaires ; Sécurité sociale -- Travailleurs indépendants
related: https://data.bnf.fr/ark:/12148/cb119826688
broader: https://data.bnf.fr/ark:/12148/cb119498409
alternative label: Protection sociale
modified: 2023-06-08
narrower: cb13319442h
related: https://data.bnf.fr/ark:/12148/cb122669588
editorial note: EUROVOC Thesaurus. - http://europa.eu/eurovoc. - 2009-05-04 Lexique des sciences sociales / M. Grawitz, 1994. - . - La sécurité sociale / G. Dorion, A. Guionnet, 2004. - . -
related: https://data.bnf.fr/ark:/12148/cb14635324d
related: https://data.bnf.fr/ark:/12148/cb150215884
FRBNF: 11934328
editorial note: Grand Larousse universel (art. : Sécurité). - . - Encycl. universalis. - http://www.universalis-edu.com. - 2009-05-04