Prusse
editorial note: Robert encyclopédique des noms propres 2008. - . - Encycl. universalis. - http://www.universalis-edu.com. - 2011-10-25 Wikipédia. - http://fr.wikipedia.org. - 2011-10-25
scope note: Sous cette vedette, on trouve les documents sur la Prusse depuis ses origines (l'ancien peuple balte des Prussiens) jusqu'à sa disparition en tant qu'État en 1947
domaine litteral: Géographie de l'Europe
P61160: http://www.rdaregistry.info/termList/statIdentification/1001
domaine litteral: Histoire de l'Europe
alternative label: Preussen @de
modified: 2022-04-29
editorial note: Normdaten SWD, 2005-01 : Preussen <Ordensstaat>, puis Preussen <Herzogtum>, puis Preussen. - . - Grand Larousse universel. - . -
created: 1985-07-06
related: cb11970725k
related: https://data.bnf.fr/ark:/12148/cb120486554
narrower: https://data.bnf.fr/ark:/12148/cb119521192
alternative label: Prusse (Allemagne)
related: cb12417771g
related: cb16587970v
narrower: cb12006111t
related: cb12115089m
type: Concept
alternative label: Prusse (Royaume)
FRBNF: 11934435
related: https://data.bnf.fr/ark:/12148/cb119707247
is part of: r167
alternative label: Prusse (Duché)
related: https://data.bnf.fr/ark:/12148/cb119456983

Prussia (Germany)