Arbres
related: https://data.bnf.fr/ark:/12148/cb144983121
related: https://data.bnf.fr/ark:/12148/cb119314375
P61160: http://www.rdaregistry.info/termList/statIdentification/1001
related: cb16757778s
narrower: cb11971021h
related: cb14644574g
related: https://data.bnf.fr/ark:/12148/cb12254597c
related: https://data.bnf.fr/ark:/12148/cb15044378d
narrower: cb12201702n
type: Concept
domaine: https://data.bnf.fr/ark:/12148/cb119460542
scope note: Voir aussi aux noms des différentes essences d'Arbres
related match: Trees
is part of: r166
narrower: https://data.bnf.fr/ark:/12148/cb131895019
narrower: https://data.bnf.fr/ark:/12148/cb166864278
modified: 2023-06-08
narrower: cb11930933x
narrower: https://data.bnf.fr/ark:/12148/cb15597271b
narrower: cb13534405v
FRBNF: 11934786
created: 1985-07-06
broader: https://data.bnf.fr/ark:/12148/cb119777258
narrower: cb15106911m
related: https://data.bnf.fr/ark:/12148/cb119399840
narrower: https://data.bnf.fr/ark:/12148/cb135344035
narrower: cb11933900p
narrower: cb11965527q
alternative label: Dendrologie