Céramique
alternative label: Contribution à la céramique
narrower: cb11942638h
related: cb11944006q
narrower: https://data.bnf.fr/ark:/12148/cb123123981
alternative label: Ceramiche @it
related: https://data.bnf.fr/ark:/12148/cb124197860
narrower: https://data.bnf.fr/ark:/12148/cb124272014
related: https://data.bnf.fr/ark:/12148/cb12561714d
alternative label: Oeuvres -- Céramique
modified: 2024-04-15
related: https://data.bnf.fr/ark:/12148/cb119311360
narrower: https://data.bnf.fr/ark:/12148/cb119409156
narrower: cb12526841z
narrower: https://data.bnf.fr/ark:/12148/cb12536658b
related: https://data.bnf.fr/ark:/12148/cb169140012
domaine: https://data.bnf.fr/ark:/12148/cb11933241b
related: cb11931135n
alternative label: Poterie
narrower: cb11931379t
alternative label: Céramiques
narrower: cb15542194g
narrower: https://data.bnf.fr/ark:/12148/cb13601335b
narrower: cb14458436g
narrower: cb15779665x
related: https://data.bnf.fr/ark:/12148/cb119903476
alternative label: Céramique domestique
narrower: cb16958383v
is part of: r166
alternative label: Oeuvres -- Sculpture en céramique
related: https://data.bnf.fr/ark:/12148/cb16603390c
alternative label: Céramique d'art
narrower: https://data.bnf.fr/ark:/12148/cb119359067
related: cb17097079z
related match: Art pottery
narrower: https://data.bnf.fr/ark:/12148/cb119452651
alternative label: Art céramique
scope note: Voir aussi les vedettes du type Céramique [adjectif de civilisation, ethnique, de nationalité ou géographique, de religion ou de style]
narrower: cb11957129k
editorial note: Grand Larousse illustré. - . - Dict. des termes d'art et d'archéologie / J. Girard, 2007. - . -
narrower: cb12092279m
narrower: https://data.bnf.fr/ark:/12148/cb135417233
narrower: https://data.bnf.fr/ark:/12148/cb16706865f
alternative label: Poteries
FRBNF: 11935435
P61160: http://www.rdaregistry.info/termList/statIdentification/1001
broader: https://data.bnf.fr/ark:/12148/cb150324571
related: cb11976847m
type: Concept
narrower: https://data.bnf.fr/ark:/12148/cb124088050
created: 1985-07-06
related: https://data.bnf.fr/ark:/12148/cb119659312
domaine litteral: Dessin. Arts décoratifs
narrower: https://data.bnf.fr/ark:/12148/cb11961607d
scope note: S'emploie également en subdivision
narrower: https://data.bnf.fr/ark:/12148/cb120118452

Pottery

Ceramiche