Latin (langue)
related: cb12112218x
type: Concept
related: cb13575393r
related: https://data.bnf.fr/ark:/12148/cb121046545
related: cb12127914w
alternative label: Latin (langue) classique
related: cb13181144j
narrower: https://data.bnf.fr/ark:/12148/cb119473424
FRBNF: 11935508
related: https://data.bnf.fr/ark:/12148/cb11936311d
narrower: https://data.bnf.fr/ark:/12148/cb119800920
P61160: http://www.rdaregistry.info/termList/statIdentification/1001
created: 1985-07-06
broader: cb12647687j
related: cb14630224x
modified: 2023-06-08
related: cb12203275z
related: cb13324182x
scope note: S'emploie également en subdivision
related: https://data.bnf.fr/ark:/12148/cb180052690
scope note: Sous cette vedette, on trouve les documents sur la langue latine en général, ainsi que les documents sur le latin classique. Les documents sur un état historique particulier se trouvent sous les vedettes spécifiques, par ex. : Latin (langue) archaïque
narrower: cb11932234t
is part of: r166
editorial note: Grand Larousse universel. - . - Encycl. universalis (art. : Langue latine). - http://www.universalis-edu.com. - 2009-01-23
related: https://data.bnf.fr/ark:/12148/cb12078687c
alternative label: Et le latin
related: cb14627496t
related: cb11975709j
alternative label: Latin classique (langue)
related: cb12067308z
alternative label: Langue latine
related: cb12463603s
narrower: cb11932233g
narrower: https://data.bnf.fr/ark:/12148/cb121082739
narrower: https://data.bnf.fr/ark:/12148/cb119578494
related: cb11935507g
related: cb11932282p
narrower: https://data.bnf.fr/ark:/12148/cb12125800f
related: https://data.bnf.fr/ark:/12148/cb122168490
related: cb17938639x
related: https://data.bnf.fr/ark:/12148/cb122346210
related: cb11950451w
related: cb11932414r
narrower: cb11965675v
related: https://data.bnf.fr/ark:/12148/cb12104150d
related: https://data.bnf.fr/ark:/12148/cb12216159c
related: https://data.bnf.fr/ark:/12148/cb120181047
related: https://data.bnf.fr/ark:/12148/cb123262309
related: https://data.bnf.fr/ark:/12148/cb125531339
broader: https://data.bnf.fr/ark:/12148/cb119495514
editorial note: Les langues du monde / M. Sala, I. Vintila-Radulescu, 1984. - . - Les langues du monde / A. Meillet, M. Cohen, 1981. - . - L'aménagement linguistique dans le monde. - http://www.tlfq.ulaval.ca. - 2009-01-23
related: https://data.bnf.fr/ark:/12148/cb126475429
related: https://data.bnf.fr/ark:/12148/cb119426375
related: cb12025795h
domaine litteral: Langues

Latin language