Semiconducteurs
related: cb13179368t
alternative label: Composants à semiconducteurs
domaine: cb11933639w
broader: cb11941210s
narrower: https://data.bnf.fr/ark:/12148/cb13755972c
narrower: https://data.bnf.fr/ark:/12148/cb122674793
narrower: cb11932231s
alternative label: Semiconducteurs cristallins
is part of: r166
modified: 2018-12-07
narrower: https://data.bnf.fr/ark:/12148/cb122853594
broader: cb11944392z
narrower: https://data.bnf.fr/ark:/12148/cb124219995
narrower: cb11978659j
narrower: https://data.bnf.fr/ark:/12148/cb119594783
domaine: cb11933127h
narrower: https://data.bnf.fr/ark:/12148/cb119786613
alternative label: Matériaux semiconducteurs
narrower: https://data.bnf.fr/ark:/12148/cb120632615
created: 1985-07-06
broader: cb11978663s
narrower: cb13163535r
narrower: cb12258824z
alternative label: Semiconducteurs électroniques
narrower: cb12287381s
narrower: https://data.bnf.fr/ark:/12148/cb122664535
alternative label: Dispositifs à semiconducteurs
broader: https://data.bnf.fr/ark:/12148/cb11978662f
narrower: https://data.bnf.fr/ark:/12148/cb122674809
narrower: https://data.bnf.fr/ark:/12148/cb119667710
narrower: cb17708765s
FRBNF: 11935848
related: https://data.bnf.fr/ark:/12148/cb119403595
related: https://data.bnf.fr/ark:/12148/cb12261517c
narrower: https://data.bnf.fr/ark:/12148/cb13325534d
narrower: cb12064112x
narrower: https://data.bnf.fr/ark:/12148/cb121021998
narrower: cb12292939n
alternative label: Semi-conducteurs
editorial note: Grand Larousse universel : semi-conducteur. - . - Grand Robert de la langue française, 2001 : semi-conducteur. - . -
narrower: cb11966722s
narrower: cb12266454h
narrower: https://data.bnf.fr/ark:/12148/cb16153019b
alternative label: Semiconducteurs intrinsèques
narrower: https://data.bnf.fr/ark:/12148/cb12556474f
narrower: https://data.bnf.fr/ark:/12148/cb122670163
narrower: cb13572932g
P61160: http://www.rdaregistry.info/termList/statIdentification/1001
related: cb11978660r
narrower: cb13532466k
narrower: https://data.bnf.fr/ark:/12148/cb11958732c
narrower: cb11933621t
scope note: Voir aussi aux matériaux semiconducteurs particuliers, par ex. : Silicium
narrower: https://data.bnf.fr/ark:/12148/cb122665941
narrower: cb12258235z
narrower: cb12125621v
narrower: cb11940133x
type: Concept
related: https://data.bnf.fr/ark:/12148/cb171528241
narrower: cb12111317m
narrower: https://data.bnf.fr/ark:/12148/cb135064093
broader: cb11934822z

Semiconductors