Champagne (France)
narrower: https://data.bnf.fr/ark:/12148/cb119370067
narrower: cb11945068h
related: https://data.bnf.fr/ark:/12148/cb11949651d
narrower: https://data.bnf.fr/ark:/12148/cb122182683
related: cb16569713j
narrower: cb11931650x
P61160: http://www.rdaregistry.info/termList/statIdentification/1001
is part of: r167
related: cb11942345z
related: https://data.bnf.fr/ark:/12148/cb125420896
narrower: cb11969202h
related: cb17023112j
created: 1985-07-06
narrower: cb11937122r
editorial note: Grand Larousse universel. - . - Robert encyclopédique des noms propres 2008. - . -
related: cb17096145p
domaine litteral: Géographie de la France
note: Comté, puis province de la France (capitale : Troyes). Elle forme une région administrative (1956-1976) comprenant 4 départements : Ardennes, Aube, Haute-Marne et Marne (chef-lieu : Châlons-en-Champagne), et appelée Champagne, puis Champagne-Ardennes et enfin Champagne-Ardenne. Elle fusionne le 1er janvier 2016 avec l'Alsace et la Lorraine pour former le Grand-Est
narrower: https://data.bnf.fr/ark:/12148/cb119377619
type: Concept
modified: 2017-03-20
related: cb16612505t
FRBNF: 11936039
scope note: Voir aussi la subdivision Et la Champagne [sans subd. géogr.] aux collectivités et aux personnes
related: https://data.bnf.fr/ark:/12148/cb11969295b

Champagne-Ardenne (France)