Sacrifice
alternative label: Sacrifice propitiatoire
P61160: http://www.rdaregistry.info/termList/statIdentification/1001
narrower: cb17083271k
created: 1985-07-06
alternative label: Holocauste
domaine: cb11963568t
is part of: r166
alternative label: Oblations
modified: 2023-06-08
related: cb17983841v
narrower: https://data.bnf.fr/ark:/12148/cb11963582c
narrower: cb11963583q
alternative label: Sacrifice expiatoire
narrower: https://data.bnf.fr/ark:/12148/cb11978833d
editorial note: Grand Larousse universel. - . - Trésor de la langue française. - . -
alternative label: Rituels sacrificiels
narrower: https://data.bnf.fr/ark:/12148/cb120794214
broader: https://data.bnf.fr/ark:/12148/cb119404970
alternative label: Oblation
alternative label: Holocaustes
alternative label: Sacrifices
type: Concept
scope note: Peut se subdiviser par religion, confession ou secte
alternative label: Rites sacrificiels
alternative label: Offrande
FRBNF: 11936575
related: cb12335769p
alternative label: Offrandes
domaine litteral: Anthropologie. Ethnologie
alternative label: Immolation
broader: cb12042625r
narrower: cb13553940x
alternative label: Immolations

Sacrifice