Féminisme
related: https://data.bnf.fr/ark:/12148/cb125090114
narrower: https://data.bnf.fr/ark:/12148/cb166447989
domaine litteral: Sciences sociales. Sociologie
is part of: r166
broader: https://data.bnf.fr/ark:/12148/cb119313952
related: https://data.bnf.fr/ark:/12148/cb119480505
related: https://data.bnf.fr/ark:/12148/cb120169477
related: cb12121789s
alternative label: Mouvements de libération des femmes
related: https://data.bnf.fr/ark:/12148/cb178835399
type: Concept
alternative label: Cause féminine
related: https://data.bnf.fr/ark:/12148/cb11976480b
alternative label: Mouvement féministe
P61160: http://www.rdaregistry.info/termList/statIdentification/1001
related: https://data.bnf.fr/ark:/12148/cb167584081
related: https://data.bnf.fr/ark:/12148/cb121924707
related: https://data.bnf.fr/ark:/12148/cb161234650
related: https://data.bnf.fr/ark:/12148/cb18004211f
related: https://data.bnf.fr/ark:/12148/cb119552281
narrower: https://data.bnf.fr/ark:/12148/cb178916248
narrower: https://data.bnf.fr/ark:/12148/cb119641966
scope note: S'emploie également en subdivision
related: https://data.bnf.fr/ark:/12148/cb119313921
related: https://data.bnf.fr/ark:/12148/cb124116367
narrower: cb13508347v
narrower: cb17866961w
related: https://data.bnf.fr/ark:/12148/cb119556551
alternative label: Mouvement de libération des femmes
narrower: https://data.bnf.fr/ark:/12148/cb122400803
FRBNF: 11938848
modified: 2023-06-08
narrower: https://data.bnf.fr/ark:/12148/cb17891793c
alternative label: Émancipation de la femme
related: https://data.bnf.fr/ark:/12148/cb13325883f
created: 1985-07-06
narrower: https://data.bnf.fr/ark:/12148/cb133192888
alternative label: Et le féminisme
alternative label: Femmes -- Libération
related: cb11971187q
narrower: https://data.bnf.fr/ark:/12148/cb133188086
related: https://data.bnf.fr/ark:/12148/cb178328433
related: https://data.bnf.fr/ark:/12148/cb135364834
narrower: https://data.bnf.fr/ark:/12148/cb131896901
related: cb14469059g
narrower: cb12560461v
related: cb12436621t
scope note: Voir aussi aux noms des mouvements féministes
narrower: cb12172454k
narrower: cb11994249k
narrower: https://data.bnf.fr/ark:/12148/cb161238920
editorial note: Dict. des sciences humaines / S. Mesure, P. Savidan, 2006. - . - Dict. des sciences humaines / J.-F. Dortier, 2004. - . -
narrower: cb18101559q
narrower: cb12431811v
narrower: cb17990562g
alternative label: Femmes -- Émancipation
related: cb16026336p
related: https://data.bnf.fr/ark:/12148/cb119825231
broader: https://data.bnf.fr/ark:/12148/cb119477578
alternative label: Libération de la femme
editorial note: Grand Larousse universel. - . - Grand Robert de la langue française, 2001. - . - Encycl. universalis. - http://www.universalis-edu.com. - 2010-12-02
narrower: cb13498300w

Feminism