Cimetières
narrower: https://data.bnf.fr/ark:/12148/cb12653593f
alternative label: Cimetières paysagers
alternative label: Jardins funéraires
related: https://data.bnf.fr/ark:/12148/cb12651816b
domaine litteral: Anthropologie. Ethnologie
related: cb12647777h
related: cb12651520r
related match: Cemeteries
FRBNF: 11938920
related: cb11932525p
related: cb11931491z
is part of: r166
narrower: https://data.bnf.fr/ark:/12148/cb181010689
scope note: Voir aussi aux noms des cimetières particuliers, par ex. : Paris (France) -- Cimetière du Père-Lachaise
narrower: https://data.bnf.fr/ark:/12148/cb122324182
domaine litteral: Urbanisme. Architecture du paysage
narrower: https://data.bnf.fr/ark:/12148/cb146148829
related: cb16985833k
alternative label: Columbariums
type: Concept
alternative label: Champs du repos
related: cb11936756g
narrower: cb11978052g
modified: 2023-06-07
narrower: https://data.bnf.fr/ark:/12148/cb169713947
narrower: cb13162750z
narrower: cb11966824r
related: https://data.bnf.fr/ark:/12148/cb126532959
P61160: http://www.rdaregistry.info/termList/statIdentification/1001
created: 1985-07-06
alternative label: Nécropoles
narrower: cb17781161q
related: https://data.bnf.fr/ark:/12148/cb11934475f
broader: https://data.bnf.fr/ark:/12148/cb119377452