Italiens
related: https://data.bnf.fr/ark:/12148/cb121099875
narrower: https://data.bnf.fr/ark:/12148/cb181092694
narrower: https://data.bnf.fr/ark:/12148/cb12114726d
narrower: https://data.bnf.fr/ark:/12148/cb12099033f
narrower: cb14539599n
related: https://data.bnf.fr/ark:/12148/cb120317007
narrower: cb12026491j
narrower: https://data.bnf.fr/ark:/12148/cb120382565
narrower: https://data.bnf.fr/ark:/12148/cb120268146
narrower: cb12535846n
related: https://data.bnf.fr/ark:/12148/cb150788562
scope note: Sous cette vedette, obligatoirement suivie d'une subdivision géographique ou de la subdivision : À l'étranger, directement ou après une subdivision de sujet, on trouve les documents sur les Italiens hors d'Italie. Les documents sur les Italiens en Italie se trouvent sous des vedettes-matière telles que : Italie -- Moeurs et coutumes ; etc.
related: cb12444937r
is part of: r166
narrower: https://data.bnf.fr/ark:/12148/cb179059727
narrower: https://data.bnf.fr/ark:/12148/cb120318177
narrower: cb13340041h
P61160: http://www.rdaregistry.info/termList/statIdentification/1001
broader: https://data.bnf.fr/ark:/12148/cb120637846
narrower: https://data.bnf.fr/ark:/12148/cb120289755
narrower: https://data.bnf.fr/ark:/12148/cb181318533
narrower: cb16955196x
narrower: https://data.bnf.fr/ark:/12148/cb12131904b
narrower: https://data.bnf.fr/ark:/12148/cb12031388c
narrower: cb13180410t
narrower: https://data.bnf.fr/ark:/12148/cb120318595
created: 1985-07-06
narrower: https://data.bnf.fr/ark:/12148/cb181382205
narrower: cb16043046v
related: cb12303367s
narrower: https://data.bnf.fr/ark:/12148/cb122401346
related: https://data.bnf.fr/ark:/12148/cb150829025
related: https://data.bnf.fr/ark:/12148/cb12048241b
narrower: cb18019454p
narrower: cb12049018h
related: https://data.bnf.fr/ark:/12148/cb150828188
narrower: cb12048314q
narrower: cb12325655h
FRBNF: 11939213
narrower: cb12012180w
narrower: https://data.bnf.fr/ark:/12148/cb121373493
narrower: https://data.bnf.fr/ark:/12148/cb17783997d
related: cb12075882g
related: https://data.bnf.fr/ark:/12148/cb133198220
narrower: https://data.bnf.fr/ark:/12148/cb123060890
narrower: https://data.bnf.fr/ark:/12148/cb12125328f
narrower: https://data.bnf.fr/ark:/12148/cb181525308
narrower: https://data.bnf.fr/ark:/12148/cb12009901f
related: cb13769846q
narrower: https://data.bnf.fr/ark:/12148/cb12075229c
narrower: cb12444429r
type: Concept
related: cb11942485g
narrower: https://data.bnf.fr/ark:/12148/cb12246551b
narrower: cb15084185z
narrower: https://data.bnf.fr/ark:/12148/cb15083187d
narrower: cb12209543m
related: cb16976836n
domaine: cb12648641g
narrower: https://data.bnf.fr/ark:/12148/cb120270774
narrower: cb13166511g
related: https://data.bnf.fr/ark:/12148/cb119321456
related: cb12131809s
narrower: cb12009569z
narrower: cb12178375q
narrower: cb11976606g
modified: 2022-06-22

Italians