1940-1945
FRBNF: 11939513
type: Concept
P61160: http://www.rdaregistry.info/termList/statIdentification/1001
note: La précision a été supprimée pour la subdivision, car la Libération a eu lieu à des dates différentes selon les lieux
is part of: r166
created: 1985-07-06
domaine litteral: Histoire de la France
scope note: Pour les lieux hors de France et pour les sujets, employer les vedettes matière commençant par Guerre mondiale (1939-1945), ou la subdivision chronologique affranchie 1900-1945
scope note: S'emploie uniquement en subdivision chronologique [sans subd. géogr.] aux noms de lieux français, par ex. : Ardèche (France) -- 1940-1945. Une vedette matière additionnelle est établie à partir de Guerre mondiale (1939-1945), par ex. : Guerre mondiale (1939-1945) -- France -- Ardèche (France)
related: https://data.bnf.fr/ark:/12148/cb11939017c
modified: 2017-12-21
is part of: r168
alternative label: 1940-1945 (subdivision)