Théorie des jeux
alternative label: Jeux, Théorie des
narrower: cb17046905m
narrower: cb11961524q
narrower: https://data.bnf.fr/ark:/12148/cb119318467
narrower: https://data.bnf.fr/ark:/12148/cb12480498f
narrower: https://data.bnf.fr/ark:/12148/cb169941804
created: 1985-07-06
is part of: r166
related: https://data.bnf.fr/ark:/12148/cb122708907
broader: cb11950116j
narrower: cb18056298v
scope note: Voir aussi la subdivision Simulation, Méthodes de aux sujets noms communs appropriés (domaines, disciplines) pour la mise au point ou l'emploi de plusieurs types de modèles pour leur étude
editorial note: Trésor de la langue française. - . - Encycl. universalis. - http://www.universalis-edu.com. - 2010-07-20
related: cb11947617r
related: cb11941329g
narrower: https://data.bnf.fr/ark:/12148/cb121173459
broader: cb11956771s
modified: 2023-06-08
narrower: cb17145923g
type: Concept
P61160: http://www.rdaregistry.info/termList/statIdentification/1001
FRBNF: 11941518
narrower: cb16519191n
narrower: cb11978092q
domaine: https://data.bnf.fr/ark:/12148/cb11932434c
related: cb11933269q
narrower: https://data.bnf.fr/ark:/12148/cb12526229f
narrower: cb12332414v
broader: cb11932639n

Game theory