Moyen-Orient
type: Concept
narrower: cb11941820r
scope note: Sous cette vedette on trouve les documents sur l'ensemble de l'Asie occidentale, et éventuellement l'Égypte et du Soudan. Les documents sur les pays riverains de la Méditerranée orientale (Chypre, Égypte, Israël, Liban, Palestine, Syrie) et la Jordanie se trouvent sous Proche-Orient
narrower: https://data.bnf.fr/ark:/12148/cb119334903
related: https://data.bnf.fr/ark:/12148/cb123018352
related: cb12348881r
P61160: http://www.rdaregistry.info/termList/statIdentification/1001
narrower: cb11945649w
narrower: https://data.bnf.fr/ark:/12148/cb119337213
related: cb11963937n
related: https://data.bnf.fr/ark:/12148/cb15081624d
broader: https://data.bnf.fr/ark:/12148/cb119765364
related: https://data.bnf.fr/ark:/12148/cb119768030
narrower: https://data.bnf.fr/ark:/12148/cb119320855
related: cb12235620w
created: 1985-07-06
is part of: r167
related: https://data.bnf.fr/ark:/12148/cb12133019c
domaine litteral: Géographie du reste du monde
broader: cb11975539x
narrower: cb11934242x
related: cb12156828p
FRBNF: 11941591
narrower: https://data.bnf.fr/ark:/12148/cb11941608b
related: cb11931634p
related: cb12501782n
related: https://data.bnf.fr/ark:/12148/cb121853516
narrower: https://data.bnf.fr/ark:/12148/cb119424577
narrower: https://data.bnf.fr/ark:/12148/cb119309824
modified: 2017-02-13

Middle East