Église luthérienne
created: 1985-07-06
related: https://data.bnf.fr/ark:/12148/cb120989628
FRBNF: 11952246
type: Concept
alternative label: Églises luthériennes
is part of: r166
domaine: cb11963568t
modified: 2023-06-08
alternative label: Église évangélique luthérienne
scope note: Sous cette vedette, on trouve les documents sur l'ensemble des dénominations luthériennes ainsi que les documents sur les dénominations luthériennes particulières que l'on ne peut identifier
P61160: http://www.rdaregistry.info/termList/statIdentification/1001
broader: cb11976087n
related: https://data.bnf.fr/ark:/12148/cb119569820
scope note: S'emploie également en subdivision aux sujets religieux
scope note: Voir aussi aux différentes dénominations luthériennes, par ex. : Église de la confession d'Augsbourg d'Alsace et de Lorraine
related: cb12079546r
related: https://data.bnf.fr/ark:/12148/cb120087338

Lutheran Church