Race
related: cb11946804q
alternative label: Homme -- Races
narrower: cb12395134m
FRBNF: 11956358
related: cb11953253r
narrower: cb12395164j
alternative label: Races humaines
is part of: r166
related: cb11940470z
type: Concept
related: cb11976183j
related: cb11977005q
domaine: https://data.bnf.fr/ark:/12148/cb119440835
narrower: https://data.bnf.fr/ark:/12148/cb123951636
alternative label: Race humaine
P61160: http://www.rdaregistry.info/termList/statIdentification/1001
related: cb15025681z
related: https://data.bnf.fr/ark:/12148/cb179834276
related: cb11982646z
modified: 2022-10-25
broader: https://data.bnf.fr/ark:/12148/cb167460819
related: https://data.bnf.fr/ark:/12148/cb119475431
related: cb12099178p
editorial note: Dict. de l'ethnologie et de l'anthropologie / P. Bonte, M. Izard, 1991. - . - Le dict. des sciences humaines / J.-F. Dortier, 2004. - . - L'idée de race dans les sciences humaines et la littérature, XVIIIe-XIXe siècles / S. Moussa, 2003. - . -
domaine litteral: Anthropologie. Ethnologie
scope note: Sous cette vedette, on trouve les documents sur la notion de race, en général, ainsi que sur la notion de race humaine, en particulier. Les documents sur les races animales se trouvent sous Races
editorial note: Grand Larousse universel. - . - Encycl. universalis, 1989. - . -
created: 1985-07-06

Race