Race
related: cb11976183j
domaine litteral: Anthropologie. Ethnologie
related: cb11977005q
alternative label: Homme -- Races
created: 1985-07-06
modified: 2022-10-25
scope note: Sous cette vedette, on trouve les documents sur la notion de race, en général, ainsi que sur la notion de race humaine, en particulier. Les documents sur les races animales se trouvent sous Races
related: cb15025681z
is part of: r166
related: cb11946804q
narrower: cb12395134m
domaine: https://data.bnf.fr/ark:/12148/cb119440835
FRBNF: 11956358
type: Concept
related: cb11940470z
related: cb11953253r
narrower: cb12395164j
alternative label: Race humaine
broader: https://data.bnf.fr/ark:/12148/cb167460819
P61160: http://www.rdaregistry.info/termList/statIdentification/1001
related: cb12099178p
alternative label: Races humaines
editorial note: Dict. de l'ethnologie et de l'anthropologie / P. Bonte, M. Izard, 1991. - . - Le dict. des sciences humaines / J.-F. Dortier, 2004. - . - L'idée de race dans les sciences humaines et la littérature, XVIIIe-XIXe siècles / S. Moussa, 2003. - . -
related: https://data.bnf.fr/ark:/12148/cb179834276
editorial note: Grand Larousse universel. - . - Encycl. universalis, 1989. - . -
related: https://data.bnf.fr/ark:/12148/cb119475431
related: cb11982646z
narrower: https://data.bnf.fr/ark:/12148/cb123951636

Race