Suède
related: https://data.bnf.fr/ark:/12148/cb125485682
narrower: https://data.bnf.fr/ark:/12148/cb125486988
related: https://data.bnf.fr/ark:/12148/cb12489548b
narrower: cb12099022s
is part of: r167
related: cb12299890t
related: cb12217427t
type: Concept
related: https://data.bnf.fr/ark:/12148/cb119623321
modified: 2017-02-13
created: 1985-07-06
narrower: https://data.bnf.fr/ark:/12148/cb119399066
related: https://data.bnf.fr/ark:/12148/cb11969773d
related: cb12008605r
related: https://data.bnf.fr/ark:/12148/cb12250564f
related: https://data.bnf.fr/ark:/12148/cb12310268b
related: cb12503721x
broader: https://data.bnf.fr/ark:/12148/cb119411633
scope note: Voir aussi la subdivision Et la Suède [sans subd. géogr.] aux collectivités et aux personnes
domaine litteral: Géographie de l'Europe
FRBNF: 11962331
related: cb12048065s
related: cb17996777h
narrower: cb12387170r
editorial note: Grand Larousse universel. - . - Robert encyclopédique des noms propres 2008. - . - Encycl. universalis. - http://www.universalis-edu.com. - 2011-12-08
broader: https://data.bnf.fr/ark:/12148/cb11934129f
related: https://data.bnf.fr/ark:/12148/cb120086032
related: cb11934421h
related: https://data.bnf.fr/ark:/12148/cb120087129
P61160: http://www.rdaregistry.info/termList/statIdentification/1001
related: https://data.bnf.fr/ark:/12148/cb122579856
related: https://data.bnf.fr/ark:/12148/cb12086856c

Sweden