Prix
narrower: https://data.bnf.fr/ark:/12148/cb122670132
broader: cb11951016h
broader: cb13318359q
narrower: cb11975505m
narrower: https://data.bnf.fr/ark:/12148/cb119787098
FRBNF: 11970967
scope note: S'emploie également en subdivision aux industries (à défaut de vedette désignant les produits eux mêmes) et sujets noms communs appropriés (produits), par ex. : Produits pétroliers -- Prix
related: https://data.bnf.fr/ark:/12148/cb119803590
narrower: cb12426068m
alternative label: Juste prix
modified: 2023-06-08
scope note: Voir aussi la subdivision de sujet ou de forme Tarifs aux sujets noms communs appropriés (services, services publics, produits, etc.)
is part of: r166
related: cb13162999v
broader: cb11934136q
related: https://data.bnf.fr/ark:/12148/cb13318683d
narrower: https://data.bnf.fr/ark:/12148/cb11970941c
related: https://data.bnf.fr/ark:/12148/cb119512162
narrower: cb11975226r
alternative label: Argus des prix
created: 1985-07-06
domaine litteral: Économie politique. Travail
narrower: https://data.bnf.fr/ark:/12148/cb119343457
related: https://data.bnf.fr/ark:/12148/cb165385970
related: cb12115104p
alternative label: Théorie des prix
P61160: http://www.rdaregistry.info/termList/statIdentification/1001
narrower: https://data.bnf.fr/ark:/12148/cb119783889
related: cb11951065q
narrower: cb11982687j
alternative label: Prix, Théorie des
narrower: cb16734610r
type: Concept
broader: cb11950105w
related match: Prices
narrower: cb11951037g
narrower: cb11975959n