Tunnels
narrower: https://data.bnf.fr/ark:/12148/cb122181486
alternative label: Galeries souterraines
P61160: http://www.rdaregistry.info/termList/statIdentification/1001
modified: 2023-06-07
alternative label: Tunnels routiers
scope note: Sous cette vedette, on trouve les documents sur les tunnels en tant qu'ouvrages d'art. Les documents sur les galeries souterraines se trouvent sous Souterrains
editorial note: Nouveau petit Robert 2010. - . - Encycl. universalis (art. : http://www.universalis-edu.com). - http://www.universalis-edu.com. - 2015-10-26
broader: https://data.bnf.fr/ark:/12148/cb11931729c
broader: cb12331207s
alternative label: Routes -- Tunnels
type: Concept
domaine: https://data.bnf.fr/ark:/12148/cb119361544
narrower: cb11971553h
related: https://data.bnf.fr/ark:/12148/cb126532641
alternative label: Passages souterrains
narrower: https://data.bnf.fr/ark:/12148/cb17000052c
is part of: r166
related: cb12566288s
narrower: https://data.bnf.fr/ark:/12148/cb145423074
domaine: cb11933639w
related: https://data.bnf.fr/ark:/12148/cb131628193
broader: cb11936922q
related: https://data.bnf.fr/ark:/12148/cb119715525
narrower: https://data.bnf.fr/ark:/12148/cb165639020
created: 1985-07-06
narrower: https://data.bnf.fr/ark:/12148/cb11958071b
FRBNF: 11975411

Tunnels