14e siècle
is part of: r166
created: 1985-07-06
related match: 14th century
domaine: https://data.bnf.fr/ark:/12148/cb119344445
scope note: S'emploie uniquement en subdivision chronologique [sans subd. géogr.] à tous sujets noms communs et noms propres, à l'exception des personnes et des sujets pour lesquels il existe un découpage chronologique spécifique
is part of: r168
broader: https://data.bnf.fr/ark:/12148/cb119757175
alternative label: 14e siècle (subdivision)
alternative label: Quatorzième siècle (subdivision)
P61160: http://www.rdaregistry.info/termList/statIdentification/1001
type: Concept
modified: 2017-02-13
FRBNF: 11977212
alternative label: XIVe siècle (subdivision)
related: https://data.bnf.fr/ark:/12148/cb119658026