Gymnastique
FRBNF: 13162671
is part of: r166
narrower: cb13163024q
related match: Gymnastics
alternative label: Sports gymniques
type: Concept
broader: https://data.bnf.fr/ark:/12148/cb133188907
related: cb12652387q
narrower: cb17808899j
scope note: Sous cette vedette, on trouve les documents sur les sports gymniques, en général, et sur les sports gymniques de compétition, en particulier. Les documents sur les différentes méthodes d'entretien de la forme physique se trouvent sous Exercices physiques
related: https://data.bnf.fr/ark:/12148/cb131627561
related: https://data.bnf.fr/ark:/12148/cb13162712d
alternative label: Disciplines gymniques
P61160: http://www.rdaregistry.info/termList/statIdentification/1001
created: 1985-07-06
narrower: cb13174942k
domaine litteral: Sports et jeux
narrower: cb12651411h
narrower: https://data.bnf.fr/ark:/12148/cb13174929c
narrower: cb13162831z
modified: 2023-06-07
narrower: cb13162786z
narrower: https://data.bnf.fr/ark:/12148/cb158789274