Ethnologie
narrower: cb13318491g
narrower: cb17972469p
narrower: https://data.bnf.fr/ark:/12148/cb11939090f
narrower: https://data.bnf.fr/ark:/12148/cb12005609d
broader: https://data.bnf.fr/ark:/12148/cb133184815
FRBNF: 13318485
narrower: cb16945386z
related: cb11931827z
narrower: https://data.bnf.fr/ark:/12148/cb11932512b
narrower: cb11931373r
scope note: Sous cette vedette, on trouve les documents sur l'ethnologie générale et ses objets d'étude. Les documents d'ethnologie régionale se trouvent sous des vedettes du type : Ethnologie -- [Subdivision géographique], par ex. : Ethnologie -- Asie du Sud-Est ; Ethnologie -- Bénin. Les documents sur les groupes ethniques particuliers se trouvent aux noms de ces groupes, par ex. : Américains d'origine allemande ; Hopi (Indiens)
domaine litteral: Anthropologie. Ethnologie
alternative label: Anthropologie sociale
related: cb11951955w
related: https://data.bnf.fr/ark:/12148/cb120348963
narrower: cb16738198k
narrower: cb13549196k
alternative label: Ethnographie
related: cb11942585r
narrower: cb16721119j
narrower: cb11948995m
narrower: https://data.bnf.fr/ark:/12148/cb121092172
alternative label: Contribution à l'ethnographie
P61160: http://www.rdaregistry.info/termList/statIdentification/1001
narrower: https://data.bnf.fr/ark:/12148/cb119353502
is part of: r166
narrower: cb11967298w
narrower: https://data.bnf.fr/ark:/12148/cb11931420f
created: 1985-07-06
related: https://data.bnf.fr/ark:/12148/cb11955452f
narrower: https://data.bnf.fr/ark:/12148/cb177108749
modified: 2023-06-08
scope note: S'emploie également en subdivision
narrower: https://data.bnf.fr/ark:/12148/cb135169268
narrower: https://data.bnf.fr/ark:/12148/cb179247825
narrower: cb18070577p
alternative label: Contribution à l'ethnologie
narrower: https://data.bnf.fr/ark:/12148/cb178620723
alternative label: Et l'ethnographie
narrower: https://data.bnf.fr/ark:/12148/cb12048223d
type: Concept
narrower: cb13319341w
narrower: cb11948042j
alternative label: Groupes ethniques -- Étude et enseignement
narrower: https://data.bnf.fr/ark:/12148/cb11947544c
narrower: cb13318500m
narrower: https://data.bnf.fr/ark:/12148/cb119721095
narrower: https://data.bnf.fr/ark:/12148/cb119694758
narrower: https://data.bnf.fr/ark:/12148/cb133188175
alternative label: Et l'ethnologie
alternative label: Anthropologie culturelle
narrower: https://data.bnf.fr/ark:/12148/cb131629797

Ethnology