Extrême droite
domaine: cb13319064q
related: cb16124893k
broader: https://data.bnf.fr/ark:/12148/cb160554668
type: Concept
P61160: http://www.rdaregistry.info/termList/statIdentification/1001
alternative label: Droite extrême
alternative label: Droite radicale
alternative label: Et l'extrême droite
related: cb12270050s
FRBNF: 13318637
alternative label: Partis d'extrême droite
alternative label: Extrême droite (science politique)
modified: 2023-06-08
scope note: Voir aussi aux noms des tendances et des partis d'extrême droite
created: 1985-07-06
alternative label: Extrémistes de droite
alternative label: Mouvements d'extrême droite
related: cb16661709j
related: cb17114554s
editorial note: Encycl. universalis. - http://www.universalis-edu.com. - 2014-02-10 Lexique de politique / C. Debbasch, 2001. - . -
alternative label: Extrémisme de droite
broader: cb11933461h
scope note: S'emploie également en subdivision
is part of: r166

Right-wing extremists