Élections
broader: cb13553871x
related: https://data.bnf.fr/ark:/12148/cb17097874f
alternative label: Élections législatives
narrower: https://data.bnf.fr/ark:/12148/cb150261093
alternative label: Élections générales
related: cb16678677n
alternative label: Consulations électorales
domaine: cb13319064q
alternative label: Scrutins
narrower: cb11941664t
related: https://data.bnf.fr/ark:/12148/cb135163060
narrower: cb12302551q
narrower: https://data.bnf.fr/ark:/12148/cb165317537
narrower: cb14635490g
related: cb13757758r
note: Sous cette vedette on trouve les documents sur le déroulement, les résultats, etc. de diverses consultations (élections au sens strict du terme, plébiscites, référendums). Les documents théoriques sur l'organisation des élections se trouvent sous la vedette Système électoral
related: cb12395254h
narrower: cb13318741r
P61160: http://www.rdaregistry.info/termList/statIdentification/1001
is part of: r166
created: 1985-07-06
narrower: cb12299842z
narrower: cb12264768j
narrower: cb11936998z
narrower: https://data.bnf.fr/ark:/12148/cb11959533d
narrower: https://data.bnf.fr/ark:/12148/cb119523722
narrower: https://data.bnf.fr/ark:/12148/cb133324291
narrower: cb11967228q
narrower: https://data.bnf.fr/ark:/12148/cb119501485
narrower: cb15898574z
narrower: https://data.bnf.fr/ark:/12148/cb178527348
modified: 2023-06-08
related: cb13545003h
narrower: https://data.bnf.fr/ark:/12148/cb157553751
related: cb16630604p
narrower: https://data.bnf.fr/ark:/12148/cb12465673f
narrower: cb11948207k
related: https://data.bnf.fr/ark:/12148/cb180255995
scope note: S'emploie également en subdivision
broader: cb13734407w
type: Concept
narrower: https://data.bnf.fr/ark:/12148/cb123528073
scope note: Ne pas employer pour les élections particulières ; voir la subdivision Élections (date), par ex. : France. Assemblée nationale (1958-....) -- Élections (1981)
alternative label: Élections politiques
narrower: https://data.bnf.fr/ark:/12148/cb170147545
FRBNF: 13318859
narrower: cb13319148r

Elections