Procès
narrower: https://data.bnf.fr/ark:/12148/cb119800595
alternative label: Procès criminels
related match: Trials, litigation, etc.
type: Concept
narrower: https://data.bnf.fr/ark:/12148/cb12128524b
narrower: cb17761193x
related: cb12093666m
alternative label: Affaires (procès)
domaine: cb13318687s
alternative label: Procès civils
alternative label: Procès (droit)
related match: Trials
narrower: https://data.bnf.fr/ark:/12148/cb12356971f
created: 1985-07-06
alternative label: Litiges
alternative label: Causes célèbres
alternative label: Procès pénal
related: cb11938594z
scope note: S'emploie également en subdivision aux collectivités (à l'exception des types de collectivités), personnes et sujets juridiques (type d'infraction notamment), par ex. : Assassinat -- Procès
scope note: Sous cette vedette, on trouve les documents sur les procès en général, ainsi que les recueils de procès
scope note: Voir aussi aux noms des procès et affaires célèbres, par ex. : Riom, Procès de (1942) ; Poisons, Affaire des (1679-1682)
P61160: http://www.rdaregistry.info/termList/statIdentification/1001
modified: 2023-06-07
narrower: cb12065679t
scope note: Voir aussi la subdivision Réclamations contre [Nom de la partie adverse]
alternative label: Affaires judiciaires
narrower: https://data.bnf.fr/ark:/12148/cb13319655d
narrower: https://data.bnf.fr/ark:/12148/cb180266103
is part of: r166
FRBNF: 13319040
narrower: cb13319039h
alternative label: Instances (droit)
narrower: cb13538141v
broader: cb13734693v
narrower: cb18026359m
related: https://data.bnf.fr/ark:/12148/cb119773224
narrower: cb12017217m
broader: https://data.bnf.fr/ark:/12148/cb11951067d