Amérique
long: -34.85
type: SpatialThing
lat: 83.1666666666667
lat long: W 165° - W 34°51' / N 83°10' - S 56°
cadre geographique: cv
lat: -56.0
long: -165.0

Amérique
narrower: cb11930876x
type: Concept
related: https://data.bnf.fr/ark:/12148/cb12082955b
P61160: http://www.rdaregistry.info/termList/statIdentification/1001
FRBNF: 11930874
domaine litteral: Géographie du reste du monde
narrower: cb11930875k
editorial note: Grand Larousse universel. - . - Robert encyclopédique des noms propres 2008. - . - Encycl. universalis. - http://www.universalis-edu.com. - 2013-02-13
narrower: cb11943260t
scope note: Voir aussi la subdivision Et l'Amérique [sans subd. géogr.] aux collectivités et aux personnes
narrower: cb13162774z
narrower: cb11943040n
created: 1985-07-06
broader: https://data.bnf.fr/ark:/12148/cb166628030
modified: 2017-02-13
is part of: r167

Amérique
narrower: cb15238493p
alternative label: Nouveau monde
FRBNF: 15238525
P61160: http://www.rdaregistry.info/termList/statIdentification/1001
type: Concept
modified: 2010-03-13
narrower: https://data.bnf.fr/ark:/12148/cb15238498d
alternative label: America @it
alternative label: Amériques
alternative label: Nouveau Continent
focus: Amérique
created: 1989-01-19
narrower: cb15238513g

America