Analyse numérique
P61160: http://www.rdaregistry.info/termList/statIdentification/1001
domaine: https://data.bnf.fr/ark:/12148/cb11932434c
narrower: https://data.bnf.fr/ark:/12148/cb121684497
related: https://data.bnf.fr/ark:/12148/cb135122538
narrower: https://data.bnf.fr/ark:/12148/cb119580224
narrower: https://data.bnf.fr/ark:/12148/cb11937713f
narrower: https://data.bnf.fr/ark:/12148/cb124106031
narrower: cb12168442t
narrower: https://data.bnf.fr/ark:/12148/cb122927482
narrower: https://data.bnf.fr/ark:/12148/cb150249492
broader: https://data.bnf.fr/ark:/12148/cb119358199
narrower: cb12281826k
broader: https://data.bnf.fr/ark:/12148/cb131626631
narrower: https://data.bnf.fr/ark:/12148/cb17160784b
FRBNF: 11930888
narrower: https://data.bnf.fr/ark:/12148/cb15011535b
narrower: https://data.bnf.fr/ark:/12148/cb122664028
narrower: https://data.bnf.fr/ark:/12148/cb144879080
narrower: https://data.bnf.fr/ark:/12148/cb123709048
narrower: https://data.bnf.fr/ark:/12148/cb119421771
narrower: cb12262157r
narrower: https://data.bnf.fr/ark:/12148/cb181095349
narrower: cb12268222t
narrower: https://data.bnf.fr/ark:/12148/cb122863101
narrower: https://data.bnf.fr/ark:/12148/cb122863539
narrower: https://data.bnf.fr/ark:/12148/cb124164199
related: cb11977576m
modified: 2023-06-08
alternative label: Méthodes numériques
alternative label: Calcul numérique
narrower: https://data.bnf.fr/ark:/12148/cb12286098f
narrower: https://data.bnf.fr/ark:/12148/cb144911343
narrower: https://data.bnf.fr/ark:/12148/cb12429588b
narrower: https://data.bnf.fr/ark:/12148/cb122674642
alternative label: Résolution numérique
narrower: cb11967923x
related: https://data.bnf.fr/ark:/12148/cb119358404
narrower: cb17142581t
narrower: cb17001857j
narrower: https://data.bnf.fr/ark:/12148/cb122936450
narrower: cb12410175h
narrower: cb17162216z
is part of: r166
narrower: cb12339507j
narrower: https://data.bnf.fr/ark:/12148/cb170292604
narrower: https://data.bnf.fr/ark:/12148/cb144142600
narrower: https://data.bnf.fr/ark:/12148/cb119593733
narrower: cb12123003s
narrower: https://data.bnf.fr/ark:/12148/cb12130355b
narrower: https://data.bnf.fr/ark:/12148/cb119313654
narrower: cb14567785n
narrower: cb17706547t
narrower: https://data.bnf.fr/ark:/12148/cb12324953d
narrower: https://data.bnf.fr/ark:/12148/cb181060973
narrower: cb13564043x
narrower: cb11938437v
narrower: https://data.bnf.fr/ark:/12148/cb119809151
narrower: cb12421937m
narrower: https://data.bnf.fr/ark:/12148/cb119791989
narrower: cb12269657t
narrower: cb11966596s
created: 1985-07-06
narrower: cb12286364z
narrower: cb12388544j
alternative label: Solutions numériques
type: Concept
related: https://data.bnf.fr/ark:/12148/cb11958804d
narrower: https://data.bnf.fr/ark:/12148/cb122645351
broader: https://data.bnf.fr/ark:/12148/cb13162715f
scope note: Voir aussi à certaines vedettes, notamment aux équations et problèmes, suivies de la subdivision Solutions numériques
narrower: https://data.bnf.fr/ark:/12148/cb16659770b
narrower: https://data.bnf.fr/ark:/12148/cb12524943f
narrower: https://data.bnf.fr/ark:/12148/cb135350902
narrower: cb12547598r
narrower: cb16567791v
alternative label: Solution numérique
scope note: Pour le catalogage, entrer chaque fois dans la liste autorité la vedette construite [tête de vedette] -- Solutions numériques correspondant à l'ouvrage à traiter
narrower: https://data.bnf.fr/ark:/12148/cb122702254
narrower: https://data.bnf.fr/ark:/12148/cb125482118

Numerical analysis