Australie
type: SpatialThing
long: 153.0
lat: -10.0
long: 115.816666666667
cadre geographique: cya
lat: -39.5
lat long: E 115°49' - E 153° / S 10° - S 39°30'

Australie
type: Concept
is part of: r167
related: https://data.bnf.fr/ark:/12148/cb12129695c
related: cb12129570r
scope note: Voir aussi la subdivision Opinion publique australienne [sans subd. géogr.] aux guerres et aux lieux
narrower: https://data.bnf.fr/ark:/12148/cb135631836
related: https://data.bnf.fr/ark:/12148/cb121187460
narrower: https://data.bnf.fr/ark:/12148/cb122343424
P61160: http://www.rdaregistry.info/termList/statIdentification/1001
narrower: cb14616229p
broader: https://data.bnf.fr/ark:/12148/cb11951560c
related: cb11960877w
related: cb12118745n
related: cb17996787t
created: 1985-07-06
related: cb15522911r
editorial note: Grand Larousse universel. - . - Encycl. universalis. - http://www.universalis-edu.com. - 2016-02-03 Atlas universel / "Le Monde", Sélection du "Reader's digest" 2000. - . -
domaine litteral: Géographie du reste du monde
narrower: cb12542920q
related: https://data.bnf.fr/ark:/12148/cb120207401
narrower: https://data.bnf.fr/ark:/12148/cb161896208
related: cb12249791v
related: https://data.bnf.fr/ark:/12148/cb121676513
narrower: https://data.bnf.fr/ark:/12148/cb12050120c
modified: 2017-02-13
related: https://data.bnf.fr/ark:/12148/cb120480335
narrower: https://data.bnf.fr/ark:/12148/cb12494617b
FRBNF: 11930990

Australie
type: Concept
created: 1989-01-19
narrower: https://data.bnf.fr/ark:/12148/cb15324128d
P61160: http://www.rdaregistry.info/termList/statIdentification/1001
alternative label: Australia @en
focus: Australie
narrower: https://data.bnf.fr/ark:/12148/cb152950008
narrower: cb17082635k
alternative label: Commonwealth of Australia @en
narrower: cb15317251q
alternative label: Nouvelle-Hollande (Australie)
modified: 2019-03-28
alternative label: Commonwealth d'Australie
narrower: https://data.bnf.fr/ark:/12148/cb153172522
FRBNF: 15238526
narrower: https://data.bnf.fr/ark:/12148/cb153012245
narrower: cb15281287j
narrower: https://data.bnf.fr/ark:/12148/cb15317250c
narrower: cb15324138q

Australia