Chemins de fer
related: cb12010485z
modified: 2024-01-08
narrower: https://data.bnf.fr/ark:/12148/cb12392941c
related: cb11978263p
related: cb11980535j
narrower: cb13318948q
editorial note: Wikidata. - https://www.wikidata.org/wiki/Q22667. - 2023-12-22 Grand Larousse universel. - . -
scope note: Voir aussi aux chemins de fer particuliers, par ex. : Nice-Cuneo, Chemin de fer
narrower: cb17704046m
related: https://data.bnf.fr/ark:/12148/cb119383487
type: Concept
narrower: https://data.bnf.fr/ark:/12148/cb171690926
alternative label: Ferrovie @it
narrower: https://data.bnf.fr/ark:/12148/cb17707365f
related: cb11934647r
narrower: cb11973387r
related: cb12238692g
narrower: cb11958072p
narrower: cb11936050g
alternative label: Réseau ferroviaire
related: cb11977664w
domaine litteral: Économie politique. Travail
related: cb11936562v
broader: cb11934482q
alternative label: Réseau de chemins de fer
related: cb12649839q
narrower: cb12068746v
related: https://data.bnf.fr/ark:/12148/cb135129598
narrower: cb11950823r
related: cb11979260w
related: https://data.bnf.fr/ark:/12148/cb11973386d
alternative label: Lignes de chemin de fer
related: cb15039246h
related: cb11978432z
created: 1985-07-06
related: https://data.bnf.fr/ark:/12148/cb119815693
is part of: r166
related: cb11951150z
narrower: https://data.bnf.fr/ark:/12148/cb119740426
related: cb11934824n
FRBNF: 11931173
related: cb11938349k
narrower: https://data.bnf.fr/ark:/12148/cb119316998
related: cb11930836p
editorial note: Encycl. universalis. - http://www.universalis-edu.com. - 2017-12-06 Les chemins de fer / Y. Chenel, 1986. - . -
related: cb11938431s
alternative label: Voies de communication ferroviaires
P61160: http://www.rdaregistry.info/termList/statIdentification/1001
narrower: https://data.bnf.fr/ark:/12148/cb14427201d
narrower: https://data.bnf.fr/ark:/12148/cb119443892
related: https://data.bnf.fr/ark:/12148/cb11965947f
narrower: cb11978275p

Railroads

Ferrovie