Florence (Toscane, Italie)
long: 11.25
lat: 43.7833333333333
type: SpatialThing
lat long: E 11°15' / N 43°47'
cadre geographique: cxat
cadre geographique: cxataq

Florence (Toscane, Italie)
alternative label: Florentia Tuscorum @la
FRBNF: 15291207
alternative label: Florentia (ville ancienne) @la
alternative label: Faesulae @la
created: 1992-03-13
alternative label: Firenze (Italie) @it
P61160: http://www.rdaregistry.info/termList/statIdentification/1001
type: Concept
broader: cb15241131t
focus: Florence (Toscane, Italie)
modified: 2010-03-13
alternative label: Fiesole @it

Florence (Italie)
type: Concept
P61160: http://www.rdaregistry.info/termList/statIdentification/1001
related: cb15538113w
note: Capitale de la Toscane
domaine litteral: Géographie de l'Europe
editorial note: Grand Larousse universel. - . - Robert encyclopédique des noms propres 2008. - . - Encycl. universalis. - http://www.universalis-edu.com. - 2011-11-24
is part of: r167
modified: 2017-02-13
related: cb16575160n
scope note: Voir aussi la subdivision Et Florence [sans subd. géogr.] aux collectivités et aux personnes
FRBNF: 11931414
created: 1985-07-06

Florence (Italy)